[CinCV TNG] Findobject plugin it impossible to build

igor_ubuntu sitelve at gmail.com
Thu Sep 21 23:56:27 CEST 2017


2017-09-19 2:40 GMT+03:00 Phyllis Smith <phylsmith2017 at gmail.com>:

> _______________________________________________
> If you are used to doing your own builds already, the simple build
> instructions are just to add:  --with-findobject=sta   .
>
> At least once findobject and OpenCV were compiled on 32-bit ubuntu version
> 14 - there were at least 3 compiler errors in some unknown sections of
> opencv, but findobject ran correctly anyway.  Also, we already know that
> the selection of the object can be tedious.     GG/Phyllis
>

I am trying to compile this monster_plugin according to your instructions
but getting (full log  http://www.datafilehost.com/d/20a64795)

./configure --prefix=/opt/cin5.1 --without-ladspa-build
--disable-dependency-tracking --with-findobject=sta,tar=
http://cinelerra-cv.org/five/src/opencv-20170916.tgz && make -j3
...
.......
/home/user/test/GG/cinelerra5/cinelerra-5.1/thirdparty/opencv/modules/imgcodecs/src/grfmt_tiff.cpp:
In member function ‘cv::TIFF* cv::TiffEncoderBufHelper::open()’:
/home/user/test/GG/cinelerra5/cinelerra-5.1/thirdparty/opencv/modules/imgcodecs/src/
*grfmt_tiff.cpp:601: error: ‘read’ is not a member of
‘cv::TiffEncoderBufHelper’*
/home/user/test/GG/cinelerra5/cinelerra-5.1/thirdparty/opencv/modules/imgcodecs/src*/grfmt_tiff.cpp:602:
error: ‘write’ is not a member of ‘cv::TiffEncoderBufHelper’*
*make[6]: ***
[modules/imgcodecs/CMakeFiles/opencv_imgcodecs.dir/src/grfmt_tiff.cpp.o]
Error 1*
make[6]: Leaving directory
`/home/user/test/GG/cinelerra5/cinelerra-5.1/thirdparty/opencv/build'
make[5]: *** [modules/imgcodecs/CMakeFiles/opencv_imgcodecs.dir/all] Error 2
make[5]: Leaving directory
`/home/user/test/GG/cinelerra5/cinelerra-5.1/thirdparty/opencv/build'
make[4]: *** [all] Error 2
make[4]: Leaving directory
`/home/user/test/GG/cinelerra5/cinelerra-5.1/thirdparty/opencv/build'
make[3]: ***
[/home/user/test/GG/cinelerra5/cinelerra-5.1/thirdparty/opencv.sta] Error 2
make[3]: Leaving directory
`/home/user/test/GG/cinelerra5/cinelerra-5.1/plugins/findobject'
make[2]: *** [findobject] Error 2
make[2]: Leaving directory
`/home/user/test/GG/cinelerra5/cinelerra-5.1/plugins'
make[1]: *** [all-recursive] Error 1
make[1]: Leaving directory `/home/user/test/GG/cinelerra5/cinelerra-5.1'
make: *** [all] Error 2
:~/test/GG/cinelerra5/cinelerra-5.1$
-------------- next part --------------
An HTML attachment was scrubbed...
URL: <http://lists.cinelerra-cv.org/pipermail/cinelerra/attachments/20170922/a8eb1303/attachment.html>


More information about the Cinelerra mailing list